Acetic acid, trifluoro-, annhydride with nitric acid

Reaction thermochemistry data

Data compiled by: Hussein Y. Afeefy, Joel F. Liebman, and Stephen E. Stein

Individual Reactions

Acetic acid, trifluoro-, anhydride + Nitric acid = C2F3NO4 + Trifluoroacetic acid

By formula: C4F6O3 + HNO3 = C2F3NO4 + C2HF3O2

Quantity Value Units Method Reference Comment
Δr-27.6kJ/molCmTsvetkov, Shmakov, et al., 1989liquid phase

References

Tsvetkov, Shmakov, et al., 1989
Tsvetkov, V.G.; Shmakov, V.A.; Sopin, V.F.; Ivanov, A.V.; Ikonnikov, A.A.; Marchenko, G.N., Enthalpies of reaction of nitric acid with acetic and trifluoroacetic anhydrides, J. Gen. Chem. USSR, 1989, 59, 1220-1222. [all data]