2-Methylquinoxaline-1,4-dioxide

Condensed phase thermochemistry data

Data compiled by: Hussein Y. Afeefy, Joel F. Liebman, and Stephen E. Stein

Quantity Value Units Method Reference Comment
Δfsolid62.9 ± 3.6kJ/molCcbAcree, Powell, et al., 1997
Quantity Value Units Method Reference Comment
Δcsolid-4747.8 ± 3.4kJ/molCcbAcree, Powell, et al., 1997

Gas phase thermochemistry data

Data compiled by: Hussein Y. Afeefy, Joel F. Liebman, and Stephen E. Stein

Quantity Value Units Method Reference Comment
Δfgas169.9 ± 7.2kJ/molCcbAcree, Powell, et al., 1997

References

Acree, Powell, et al., 1997
Acree, W.E., Jr.; Powell, J.R.; Tucker, S.A.; Ribeiro da Silva, M.D.M.C.; Matos, M.A.R.; Goncalves, J.M.; Santos, L.M.N.B.F.; Morais, V.M.F.; Pilcher, G., Thermochemical and theroretical study of some quinoxaline 1,4-dioxides and pyrazine 1,4-dioxide, J. Org. Chem., 1997, 62, 3722-3726. [all data]