n-Butyric acid tetrahydrofurfuryl ester
- Formula: C8H14O3
- Molecular weight: 158.1950
- IUPAC Standard InChIKey: FMKCDSXOYLTWBR-UHFFFAOYSA-N
- CAS Registry Number: 637-65-0
- Chemical structure:
View 3d structure (requires JavaScript / HTML 5) - Other names: 2-Furanmethanol, tetrahydro-, propanoate; 2-Furanemethanol, tetrahydro-, propanoate; Tetrahydrofurfuryl alcohol propionate; Tetrahydrofurfuryl propionate

Phase change data

Data compiled by: Robert L. Brown and Stephen E. Stein
Quantity | Value | Units | Method | Reference | Comment |
---|---|---|---|---|---|
Tboil | 478.7 | K | N/A | Weast and Grasselli, 1989 |
Reduced pressure boiling point
Tboil (K) | Pressure (bar) | Reference |
---|---|---|
359.2 | 0.004 | Weast and Grasselli, 1989 |

Normal alkane RI, non-polar column, custom temperature program

Column type | Active phase | I | Reference | Comment |
---|---|---|---|---|
Capillary | SE-30 | 1153. | Vinogradov, 2004 | Program: not specified |

Normal alkane RI, polar column, custom temperature program

Column type | Active phase | I | Reference | Comment |
---|---|---|---|---|
Capillary | Carbowax 20M | 1632. | Vinogradov, 2004 | Program: not specified |

References

Weast and Grasselli, 1989
CRC Handbook of Data on Organic Compounds, 2nd Editon, Weast,R.C and Grasselli, J.G., ed(s)., CRC Press, Inc., Boca Raton, FL, 1989, 1. [all data]