1-methyl-1,2-cyclohexanediol

Phase change data

Data compiled by: Thermodynamics Research Center, NIST Boulder Laboratories, Chris Muzny director

Quantity Value Units Method Reference Comment
Tfus354.KN/APlate, Liberman, et al., 1953Uncertainty assigned by TRC = 3. K

In addition to the Thermodynamics Research Center (TRC) data available from this site, much more physical and chemical property data is available from the following TRC products:

References

Plate, Liberman, et al., 1953
Plate, A.F.; Liberman, A.L.; Momma, N.A., Preparation of 1,2-Dialkylcycloanes. Synthesis of Stereoisomeric 1-Methyl-2-butylcyclopentanes, Izv. Akad. Nauk SSSR, 1953, 1953, 689. [all data]