2-Pentanol, acetate

Phase change data

Data compiled by: Thermodynamics Research Center, NIST Boulder Laboratories, Chris Muzny director

Quantity Value Units Method Reference Comment
Tboil408.KN/AScheer, Koogman, et al., 1963Uncertainty assigned by TRC = 2. K

In addition to the Thermodynamics Research Center (TRC) data available from this site, much more physical and chemical property data is available from the following TRC products:

Normal alkane RI, polar column, temperature ramp

Data compiled by: NIST Mass Spectrometry Data Center, William E. Wallace, director

Column type CapillaryCapillary
Active phase CP-Wax CBDB-Wax
Column length (m) 30.60.
Carrier gas HeliumH2
Substrate
Column diameter (mm) 0.250.25
Phase thickness (μm) 0.250.25
Tstart (C) 50.40.
Tend (C) 150.230.
Heat rate (K/min) 2.4.
Initial hold (min)  5.
Final hold (min) 5.25.
I 1069.1074.
ReferenceAlves, da Penha, et al., 2012Strohalm, Dregus, et al., 2007
Comment MSDC-RI MSDC-RI

References

Scheer, Koogman, et al., 1963
Scheer, J.C.; Koogman, E.C.; Sixma, F.L.J., Gas Phase Pyrolysis of Alkyl Acetates, Recl. Trav. Chim. Pays-Bas, 1963, 82, 1123. [all data]