Bis(2,2,2-trinitroethoxy)-methane

Condensed phase thermochemistry data

Data compiled by: Hussein Y. Afeefy, Joel F. Liebman, and Stephen E. Stein

Quantity Value Units Method Reference Comment
Δfsolid-402.1 ± 2.1kJ/molCcbKustova, Kirpichev, et al., 1981
Δfsolid-403.3 ± 2.7kJ/molCcrBaroody and Carpenter, 1979
Δfsolid-402. ± 3.kJ/molCcbLebedeva, Ryadnenko, et al., 1977
Quantity Value Units Method Reference Comment
Δcsolid-2423.0kJ/molCcbKustova, Kirpichev, et al., 1981
Δcsolid-2421.7 ± 2.7kJ/molCcrBaroody and Carpenter, 1979
Δcsolid-2423. ± 3.kJ/molCcbLebedeva, Ryadnenko, et al., 1977

References

Kustova, Kirpichev, et al., 1981
Kustova, L.V.; Kirpichev, E.P.; Rubtsov, Yu.I.; Avdonin, V.V.; Korepin, A.G.; Eremenko, L.T., Standard enthalpies of formation of certain nitro compounds, Bull. Acad. Sci. USSR, Div. Chem. Sci., 1981, 1830-1836. [all data]

Baroody and Carpenter, 1979
Baroody, E.E.; Carpenter, G.A., Enthalpies of formation of bitetrazole and bis(2,2,2-trinitroethyl)formal, J. Chem. Eng. Data, 1979, 24, 3-6. [all data]

Lebedeva, Ryadnenko, et al., 1977
Lebedeva, N.D.; Ryadnenko, V.L.; Gutner, N.M.; Nazarova, L.F.; Kiseleva, N.N.; Aizenshtadt, I.N.; Kirilenko, I.V., Possibility of using additive schemes for estimation of the enthalpies of formation of polyfunctional compounds, J. Anal. Chem. USSR (Engl. Transl.), 1977, 50, 726-729. [all data]