1-Butanol, 2-methyl-, acetate

Phase change data

Data compiled as indicated in comments:
BS - Robert L. Brown and Stephen E. Stein
TRC - Thermodynamics Research Center, NIST Boulder Laboratories, Chris Muzny director

Quantity Value Units Method Reference Comment
Tboil414.KN/AAmerican Tokyo Kasei, 1988BS
Tboil412.KN/AHoutman, Van Steenis, et al., 1946Uncertainty assigned by TRC = 2. K; TRC
Tboil413.15KN/AHoutman, Van Steenis, et al., 1946Uncertainty assigned by TRC = 1. K; TRC

In addition to the Thermodynamics Research Center (TRC) data available from this site, much more physical and chemical property data is available from the following TRC products:

Normal alkane RI, non-polar column, temperature ramp

Data compiled by: NIST Mass Spectrometry Data Center, William E. Wallace, director

Column type CapillaryCapillaryCapillaryCapillaryCapillary
Active phase HP-5HP-5 MSZB-1RTX-5HP-5MS
Column length (m) 30.30.30.10.30.
Carrier gas HeliumHeliumNitrogenHe
Substrate
Column diameter (mm) 0.2520.250.250.180.25
Phase thickness (μm) 0.250.250.250.20.25
Tstart (C) 60.40.45.40.60.
Tend (C) 240.250.230.275.280.
Heat rate (K/min) 3.4.3.50.4.
Initial hold (min)  2. 0.5
Final hold (min)  5. 0.5
I 874.852.879.883.882.
ReferenceCavar, Maksimovic, et al., 2010Raffo, Kelderer, et al., 2009Mierendorff, Stahl-Biskup, et al., 2008Setkova, Risticevic, et al., 2007Ebrahim Sajjadi and Mehregan, 2006
Comment MSDC-RI MSDC-RI MSDC-RI MSDC-RI MSDC-RI
Column type CapillaryCapillaryCapillaryCapillaryCapillary
Active phase RTX-5SilHP-5HP-5MSZB-1HP-5
Column length (m) 30.60.30.30.
Carrier gas HeHeHeN2
Substrate
Column diameter (mm) 0.250.320.250.25
Phase thickness (μm) 0.250.250.250.25
Tstart (C) 45.30.60.45.35.
Tend (C) 200.260.285.230.200.
Heat rate (K/min) 3.2.4.33.6.
Initial hold (min) 5.2.  2.
Final hold (min)  28.
I 882.884.5880.879.875.
ReferenceHolland, Larkov, et al., 2005Leffingwell and Alford, 2005Tesevic, Nikicevic, et al., 2005Mierendorff, Stahl-Biskup, et al., 2003Larsen and Frisvad, 1995
Comment MSDC-RI MSDC-RI MSDC-RI MSDC-RI MSDC-RI
Column type CapillaryCapillaryCapillaryCapillaryCapillary
Active phase DB-1DB-1DB-1OV-101SE-30
Column length (m) 30.60.60.50.200.
Carrier gas HeHeHeHeN2
Substrate
Column diameter (mm) 0.250.320.320.310.6
Phase thickness (μm) 1.0
Tstart (C) 40.30.30.0.20.
Tend (C) 250.210.210.225.220.
Heat rate (K/min) 3.2.2.3.2.
Initial hold (min)  4.4.1.
Final hold (min) 30.
I 861.868.869.866.863.
ReferencePeppard, 1992Takeoka and Butter, 1989Takeoka and Butter, 1989del Rosario, de Lumen, et al., 1984Dirinck, de Pooter, et al., 1981
Comment MSDC-RI MSDC-RI MSDC-RI MSDC-RI MSDC-RI

Kovats' RI, non-polar column, isothermal

Data compiled by: NIST Mass Spectrometry Data Center, William E. Wallace, director

Column type Packed
Active phase SE-30
Column length (m) 2.
Carrier gas
Substrate Chromosorb W
Column diameter (mm)
Phase thickness (μm)
Temperature (C) 100.
I 865.
ReferenceZarazir, Chovin, et al., 1970
Comment MSDC-RI

References

American Tokyo Kasei, 1988
American Tokyo Kasei, TCI American Organic Chemical 88/89 Catalog, American Tokyo Kasei, Portland, OR, 1988, 1610. [all data]

Houtman, Van Steenis, et al., 1946
Houtman, J.P.W.; Van Steenis, J.; Heertjes, P.M., Recl. Trav. Chim. Pays-Bas, 1946, 65, 781. [all data]