1-Propene, 1-(methoxymethoxy)-, (Z)-

Reaction thermochemistry data

Data compiled by: Hussein Y. Afeefy, Joel F. Liebman, and Stephen E. Stein

Individual Reactions

Methoxymethyl allyl ether = 1-Propene, 1-(methoxymethoxy)-, (Z)-

By formula: C5H10O2 = C5H10O2

Quantity Value Units Method Reference Comment
Δr-19.3 ± 0.5kJ/molEqkTaskinen, 1993liquid phase; solvent: DMSO; Isomerization

Methoxy-(E)-1-propenyloxymethane = 1-Propene, 1-(methoxymethoxy)-, (Z)-

By formula: C5H10O2 = C5H10O2

Quantity Value Units Method Reference Comment
Δr-2.3 ± 0.2kJ/molEqkTaskinen and Lahteenmaki, 1976liquid phase; solvent: Neat liquid

References

Taskinen, 1993
Taskinen, E., Relative thermodynamic stabilities of isomeric alkyl allyl and alkyl (Z)-propenyl ethers, Tetrahedron, 1993, 49, 11389-11394. [all data]

Taskinen and Lahteenmaki, 1976
Taskinen, E.; Lahteenmaki, H., Thermodynamics of vinyl ethers-XVIII unsaturated acetals, Tetrahedron, 1976, 32, 2331-2333. [all data]