Bicyclo[3.2.1]octane

Reaction thermochemistry data

Data compiled by: Hussein Y. Afeefy, Joel F. Liebman, and Stephen E. Stein

Individual Reactions

2Hydrogen + Bicyclo[3.2.1]octa-2,6-diene = Bicyclo[3.2.1]octane

By formula: 2H2 + C8H10 = C8H14

Quantity Value Units Method Reference Comment
Δr-254. ± 0.8kJ/molChydRoth, Adamczak, et al., 1991liquid phase
Δr-242.1 ± 1.1kJ/molChydTurner, Jarrett, et al., 1973liquid phase; solvent: Acetic acid

Hydrogen + Bicyclo(3.2.1)oct-2-ene = Bicyclo[3.2.1]octane

By formula: H2 + C8H12 = C8H14

Quantity Value Units Method Reference Comment
Δr-112.3 ± 0.46kJ/molChydTurner, Jarrett, et al., 1973liquid phase; solvent: Acetic acid

2Hydrogen + Dicyclopropa[cd,gh]pentalene,octahydro- = Bicyclo[3.2.1]octane

By formula: 2H2 + C8H10 = C8H14

Quantity Value Units Method Reference Comment
Δr-277.kJ/molChydRoth, Adamczak, et al., 1991liquid phase

Hydrogen + Tricyclo[3.2.1.0(1,5)]octane = Bicyclo[3.2.1]octane

By formula: H2 + C8H12 = C8H14

Quantity Value Units Method Reference Comment
Δr-300. ± 1.kJ/molChydRoth, Adamczak, et al., 1991liquid phase

References

Roth, Adamczak, et al., 1991
Roth, W.R.; Adamczak, O.; Breuckmann, R.; Lennartz, H.-W.; Boese, R., Die Berechnung von Resonanzenergien; das MM2ERW-Kraftfeld, Chem. Ber., 1991, 124, 2499-2521. [all data]

Turner, Jarrett, et al., 1973
Turner, R.B.; Jarrett, A.D.; Goebel, P.; Mallon, B.J., Heats of hydrogenation. 9. Cyclic acetylenes and some miscellaneous olefins, J. Am. Chem. Soc., 1973, 95, 790-792. [all data]