propane-1,2,3-triyl trisheptanoate

Phase change data

Data compiled by: William E. Acree, Jr., James S. Chickos

Enthalpy of vaporization

ΔvapH (kJ/mol) Temperature (K) Reference Comment
84.4416.Bureau, Jose, et al., 2001Based on data from 401. - 452. K.

References

Bureau, Jose, et al., 2001
Bureau, N.; Jose, J.; Mokbel, I.; de Hemptinne, J-C, Vapour pressure measurements and prediction for heavy esters, The Journal of Chemical Thermodynamics, 2001, 33, 11, 1485-1498, https://doi.org/10.1006/jcht.2001.0859 . [all data]