N,N,N-tris-(2-methylbutyl)amine

Phase change data

Data compiled by: Thermodynamics Research Center, NIST Boulder Laboratories, Chris Muzny director

Quantity Value Units Method Reference Comment
Tboil510.15KN/APlimpton, 1881Uncertainty assigned by TRC = 4. K

In addition to the Thermodynamics Research Center (TRC) data available from this site, much more physical and chemical property data is available from the following TRC products:

References

Plimpton, 1881
Plimpton, R.T., On the Amylamines Corresponding to the Active and Inactive Alcohols of Fermentation, J. Chem. Soc., 1881, 39, 331. [all data]