Ethyl dibromoacetate

Phase change data

Data compiled by: Robert L. Brown and Stephen E. Stein

Quantity Value Units Method Reference Comment
Tboil467.2KN/AWeast and Grasselli, 1989

Reduced pressure boiling point

Tboil (K) Pressure (bar) Reference
394.20.099Weast and Grasselli, 1989

References

Weast and Grasselli, 1989
CRC Handbook of Data on Organic Compounds, 2nd Editon, Weast,R.C and Grasselli, J.G., ed(s)., CRC Press, Inc., Boca Raton, FL, 1989, 1. [all data]