Naphthalene, 2-(phenylmethyl)-
- Formula: C17H14
- Molecular weight: 218.2931
- IUPAC Standard InChIKey: JASHTKAXQWIZGF-UHFFFAOYSA-N
- CAS Registry Number: 613-59-2
- Chemical structure:
View 3d structure (requires JavaScript / HTML 5) - Other names: Naphthalene, 2-benzyl-; 2-Benzylnaphthalene; 2-(Phenylmethyl)naphthalene

Phase change data

Data compiled by: Thermodynamics Research Center, NIST Boulder Laboratories, Chris Muzny director
Quantity | Value | Units | Method | Reference | Comment |
---|---|---|---|---|---|
Tfus | 328. | K | N/A | Anonymous, 1969 | Uncertainty assigned by TRC = 3. K |

Lee's RI, non-polar column, temperature ramp

Column type | Active phase | I | Reference | Comment |
---|---|---|---|---|
Capillary | PTE-5 | 349.45 | Wang, Jia, et al., 2000 | 30. m/0.25 mm/0.25 μm, 60. C @ 1.5 min, 8. K/min, 300. C @ 12.5 min |

Lee's RI, non-polar column, custom temperature program

Column type | Active phase | I | Reference | Comment |
---|---|---|---|---|
Capillary | DB-5MS | 339.2 | Aracil, Font, et al., 2005 | Column length: 60. m; Column diameter: 0.25 mm; Program: not specified |
Capillary | DB-5 | 349.29 | Naikwadi, Charbonneau, et al., 1987 | Column length: 30. m; Column diameter: 0.32 mm; Program: not specified |
Capillary | DB-5 | 350.51 | Naikwadi, Charbonneau, et al., 1987 | Column length: 30. m; Column diameter: 0.32 mm; Program: not specified |

References

Anonymous, 1969
Anonymous, R.,
Freon Fluorocarbons - properties and applications, E. I. Du Pont, Freon Product Information, B-2, 1969. [all data]