1,2-Cyclohexanedicarboxylic acid, cis-

Phase change data

Data compiled by: Thermodynamics Research Center, NIST Boulder Laboratories, Chris Muzny director

Quantity Value Units Method Reference Comment
Tfus463.KN/ADoering, Farber, et al., 1952Uncertainty assigned by TRC = 3. K

In addition to the Thermodynamics Research Center (TRC) data available from this site, much more physical and chemical property data is available from the following TRC products:

References

Doering, Farber, et al., 1952
Doering, W. vonE.; Farber, M.; Sayigh, A., The Oxidative Bisdecarboxylation of α,β-Dicarboxylic Acids, J. Am. Chem. Soc., 1952, 74, 4370. [all data]