2,3,5-Trinitrotoluene

Condensed phase thermochemistry data

Data compiled by: Hussein Y. Afeefy, Joel F. Liebman, and Stephen E. Stein

Quantity Value Units Method Reference Comment
Δcsolid-3447.kJ/molCcbGarner and Abernethy, 1921

References

Garner and Abernethy, 1921
Garner, W.E.; Abernethy, C.L., Heats of combustion and formation of nitro-compounds. Part I. - Benzene, toluene, phenol and methylaniline series, Proc. Roy. Soc. London A, 1921, 213-235. [all data]