2a,4a,6a,6b-Tetrahydrocyclopenta[cd]pentalene
- Formula: C10H10
- Molecular weight: 130.1864
- IUPAC Standard InChIKey: HKRMLKXSBBQRIM-UHFFFAOYSA-N
- CAS Registry Number: 6053-74-3
- Chemical structure:
View 3d structure (requires JavaScript / HTML 5) - Other names: Triquinacene; Cyclopenta[cd]pentalene, 2a,4a,6a,6b-tetrahydro-

Reaction thermochemistry data

Data compiled by: Hussein Y. Afeefy, Joel F. Liebman, and Stephen E. Stein
Individual Reactions
By formula: 3H2 + C10H10 = C10H16
Quantity | Value | Units | Method | Reference | Comment |
---|---|---|---|---|---|
ΔrH° | -326. ± 2. | kJ/mol | Chyd | Liebman, Paquette, et al., 1986 | liquid phase; solvent: Hexane |

Gas phase thermochemistry data

Data compiled by: Hussein Y. Afeefy, Joel F. Liebman, and Stephen E. Stein
Quantity | Value | Units | Method | Reference | Comment |
---|---|---|---|---|---|
ΔfH°gas | 224. ± 4.2 | kJ/mol | Chyd | Liebman, Paquette, et al., 1986 |

Gas phase ion energetics data

Data compiled as indicated in comments:
LLK - Sharon G. Lias, Rhoda D. Levin, and Sherif A. Kafafi
Ionization energy determinations
IE (eV) | Method | Reference | Comment |
---|---|---|---|
8.6 | PE | Bunzli, Frost, et al., 1973 | LLK |
9.0 | PE | Bunzli, Frost, et al., 1973 | Vertical value; LLK |

References

Liebman, Paquette, et al., 1986
Liebman, J.F.; Paquette, L.A.; Peterson, J.R.; Rogers, D.W.,
Is triquinacene homoaromatic? A thermochemical answer in the affirmative,
J. Am. Chem. Soc., 1986, 108, 8267-8268. [all data]