1-Decanone, 1-phenyl-
- Formula: C16H24O
- Molecular weight: 232.3612
- IUPAC Standard InChIKey: QQXJNLYVPPBERR-UHFFFAOYSA-N
- CAS Registry Number: 6048-82-4
- Chemical structure:
View 3d structure (requires JavaScript / HTML 5) - Other names: Capriphenone; Decanophenone; n-Decanophenone; Ketone, nonyl phenyl; 1-Phenyl-1-decanone; 1-Phenyldecan-1-one

Phase change data

Data compiled by: Robert L. Brown and Stephen E. Stein
Reduced pressure boiling point
Tboil (K) | Pressure (bar) | Reference |
---|---|---|
441.2 | 0.007 | Aldrich Chemical Company Inc., 1990 |

References

Aldrich Chemical Company Inc., 1990
Aldrich Chemical Company Inc.,
Catalog Handbook of Fine Chemicals, Aldrich Chemical Company, Inc., Milwaukee WI, 1990, 1. [all data]