Propanoic acid, 2-bromo-2-methyl-, ethyl ester

Phase change data

Data compiled as indicated in comments:
BS - Robert L. Brown and Stephen E. Stein
TRC - Thermodynamics Research Center, NIST Boulder Laboratories, Chris Muzny director
AC - William E. Acree, Jr., James S. Chickos

Quantity Value Units Method Reference Comment
Tboil436.2KN/AWeast and Grasselli, 1989BS
Tboil451.KN/ALecat, 1927Uncertainty assigned by TRC = 1. K; TRC
Quantity Value Units Method Reference Comment
Δvap45.4kJ/molAStephenson and Malanowski, 1987Based on data from 283. - 437. K. See also Stull, 1947.; AC

Reduced pressure boiling point

Tboil (K) Pressure (bar) Reference Comment
339.20.015Aldrich Chemical Company Inc., 1990BS

In addition to the Thermodynamics Research Center (TRC) data available from this site, much more physical and chemical property data is available from the following TRC products:

References

Weast and Grasselli, 1989
CRC Handbook of Data on Organic Compounds, 2nd Editon, Weast,R.C and Grasselli, J.G., ed(s)., CRC Press, Inc., Boca Raton, FL, 1989, 1. [all data]

Lecat, 1927
Lecat, M., New binary azeotropes: 7th list, Ann. Soc. Sci. Bruxelles, Ser. B, 1927, 47, 108-14. [all data]

Stephenson and Malanowski, 1987
Stephenson, Richard M.; Malanowski, Stanislaw, Handbook of the Thermodynamics of Organic Compounds, 1987, https://doi.org/10.1007/978-94-009-3173-2 . [all data]

Stull, 1947
Stull, Daniel R., Vapor Pressure of Pure Substances. Organic and Inorganic Compounds, Ind. Eng. Chem., 1947, 39, 4, 517-540, https://doi.org/10.1021/ie50448a022 . [all data]

Aldrich Chemical Company Inc., 1990
Aldrich Chemical Company Inc., Catalog Handbook of Fine Chemicals, Aldrich Chemical Company, Inc., Milwaukee WI, 1990, 1. [all data]