1,1,1,2,2,3,3-Heptachloropropane

Phase change data

Data compiled as indicated in comments:
BS - Robert L. Brown and Stephen E. Stein
AC - William E. Acree, Jr., James S. Chickos

Quantity Value Units Method Reference Comment
Tboil520.7KN/AWeast and Grasselli, 1989BS

Reduced pressure boiling point

Tboil (K) Pressure (bar) Reference Comment
438.70.12Aldrich Chemical Company Inc., 1990BS
405.20.040Weast and Grasselli, 1989BS

Enthalpy of vaporization

ΔvapH (kJ/mol) Temperature (K) Method Reference Comment
34.8428.AStephenson and Malanowski, 1987Based on data from 413. - 473. K. See also Higuchi, Endow, et al., 1949 and Dykyj, 1970.; AC

References

Weast and Grasselli, 1989
CRC Handbook of Data on Organic Compounds, 2nd Editon, Weast,R.C and Grasselli, J.G., ed(s)., CRC Press, Inc., Boca Raton, FL, 1989, 1. [all data]

Aldrich Chemical Company Inc., 1990
Aldrich Chemical Company Inc., Catalog Handbook of Fine Chemicals, Aldrich Chemical Company, Inc., Milwaukee WI, 1990, 1. [all data]

Stephenson and Malanowski, 1987
Stephenson, Richard M.; Malanowski, Stanislaw, Handbook of the Thermodynamics of Organic Compounds, 1987, https://doi.org/10.1007/978-94-009-3173-2 . [all data]

Higuchi, Endow, et al., 1949
Higuchi, Takeru.; Endow, Noboru.; Willard, John E., The Preparation and Vapor Pressure of Bromopentachloroethane; the Vapor Pressures of Heptachloropropane and Dibromotetrachloroethane, J. Am. Chem. Soc., 1949, 71, 1, 365-366, https://doi.org/10.1021/ja01169a507 . [all data]

Dykyj, 1970
Dykyj, J., Petrochemica, 1970, 10, 2, 51. [all data]