1,4-Benzenedimethanol

Phase change data

Data compiled by: Robert L. Brown and Stephen E. Stein

Reduced pressure boiling point

Tboil (K) Pressure (bar) Reference
413.70.001Weast and Grasselli, 1989

Condensed phase thermochemistry data

Data compiled by: Hussein Y. Afeefy, Joel F. Liebman, and Stephen E. Stein

Quantity Value Units Method Reference Comment
Δfsolid-94.17kcal/molCcbParks and Mosher, 1962
Quantity Value Units Method Reference Comment
Δcsolid-999.8 ± 0.4kcal/molCcbParks and Mosher, 1962Corresponding Δfsolid = -94.15 kcal/mol (simple calculation by NIST; no Washburn corrections)

References

Weast and Grasselli, 1989
CRC Handbook of Data on Organic Compounds, 2nd Editon, Weast,R.C and Grasselli, J.G., ed(s)., CRC Press, Inc., Boca Raton, FL, 1989, 1. [all data]