Benzaldehyde, phenylhydrazone
- Formula: C13H12N2
- Molecular weight: 196.2478
- IUPAC Standard InChIKey: JGOAZQAXRONCCI-UHFFFAOYSA-N
- CAS Registry Number: 588-64-7
- Chemical structure:

Condensed phase thermochemistry data

Data compiled by: Hussein Y. Afeefy, Joel F. Liebman, and Stephen E. Stein
Quantity | Value | Units | Method | Reference | Comment |
---|---|---|---|---|---|
ΔfH°solid | -53.6 | kJ/mol | Ccb | Landrieu, 1905 | Author's hf298_condensed[kcal/mol]=-10.1 kcal/mol |
ΔfH°solid | -48.5 | kJ/mol | Cm | Landrieu, 1905 | |
Quantity | Value | Units | Method | Reference | Comment |
ΔcH°solid | -6777.2 | kJ/mol | Ccb | Landrieu, 1905 | Author's hf298_condensed[kcal/mol]=-10.1 kcal/mol |

Reaction thermochemistry data

Data compiled by: Hussein Y. Afeefy, Joel F. Liebman, and Stephen E. Stein

Individual Reactions

Benzaldehyde, phenylhydrazone + Water = Benzaldehyde + Hydrazine, phenyl-

By formula: C13H12N2 + H2O = C7H6O + C6H8N2

Quantity Value Units Method Reference Comment
Δr-14.6kcal/molCmLandrieu, 1905solid phase

References

Landrieu, 1905
Landrieu, M.Ph.,
Thermochimie. - Thermochimie des hydrazones,
Compt. Rend., 1905, 141, 358-361. [all data]