2,5-dichloro-4-nitrophenol

Phase change data

Data compiled by: Thermodynamics Research Center, NIST Boulder Laboratories, Chris Muzny director

Quantity Value Units Method Reference Comment
Tfus388.KN/ASmith, Applegate, et al., 1961Uncertainty assigned by TRC = 2. K

In addition to the Thermodynamics Research Center (TRC) data available from this site, much more physical and chemical property data is available from the following TRC products:

References

Smith, Applegate, et al., 1961
Smith, M.A.; Applegate, V.C.; Johnson, B.G.H., Physical Properties of Some Halo-Nitrophenols, J. Chem. Eng. Data, 1961, 6, 607. [all data]