3-((4-Hydroxyphenyl)-methyl)-2,5-piperazinedione

Condensed phase thermochemistry data

Data compiled by: Hussein Y. Afeefy, Joel F. Liebman, and Stephen E. Stein

Quantity Value Units Method Reference Comment
Δcsolid-5531.2 ± 0.4kJ/molCcbPonomarev, Alekseeva, et al., 1962

References

Ponomarev, Alekseeva, et al., 1962
Ponomarev, V.V.; Alekseeva, T.A.; Akimova, L.N., Heats of combustion of some anhydrides, Russ. J. Phys. Chem. (Engl. Transl.), 1962, 36, 574-575. [all data]