Hexane, 3,4-diphenyl-

Phase change data

Data compiled by: Thermodynamics Research Center, NIST Boulder Laboratories, Chris Muzny director

Quantity Value Units Method Reference Comment
Tboil571.KN/AFodor and Wein, 1948Uncertainty assigned by TRC = 5. K
Quantity Value Units Method Reference Comment
Tfus365.KN/AFodor and Wein, 1948Uncertainty assigned by TRC = 4. K

In addition to the Thermodynamics Research Center (TRC) data available from this site, much more physical and chemical property data is available from the following TRC products:

References

Fodor and Wein, 1948
Fodor; Wein, J. Chem. Soc., 1948, 1948, 684. [all data]