Benzene, 1-bromo-2-nitro-
- Formula: C6H4BrNO2
- Molecular weight: 202.005
- IUPAC Standard InChIKey: ORPVVAKYSXQCJI-UHFFFAOYSA-N
- CAS Registry Number: 577-19-5
- Chemical structure:

Phase change data

Data compiled as indicated in comments:
BS - Robert L. Brown and Stephen E. Stein
TRC - Thermodynamics Research Center, NIST Boulder Laboratories, Chris Muzny director
AC - William E. Acree, Jr., James S. Chickos
Quantity | Value | Units | Method | Reference | Comment |
---|---|---|---|---|---|
Tboil | 534.2 | K | N/A | Aldrich Chemical Company Inc., 1990 | BS |
Quantity | Value | Units | Method | Reference | Comment |
Tfus | 310. | K | N/A | Timmermans, 1935 | Uncertainty assigned by TRC = 1.5 K; TRC |
Tfus | 329. | K | N/A | Buechner, 1906 | Uncertainty assigned by TRC = 2. K; TRC |
Quantity | Value | Units | Method | Reference | Comment |
ΔsubH° | 85.2 ± 0.3 | kJ/mol | ME | Ribeiro da Silva, Lobo Ferreira, et al., 2010 | Based on data from 275. to 295. K.; AC |
Enthalpy of sublimation
ΔsubH (kJ/mol) | Temperature (K) | Method | Reference | Comment |
---|---|---|---|---|
85.5 ± 0.3 | 285. | ME | Ribeiro da Silva, Lobo Ferreira, et al., 2010 | Based on data from 275. to 295. K.; AC |

Gas phase ion energetics data

Data compiled by: John E. Bartmess
Electron affinity determinations
EA (eV) | Method | Reference | Comment |
---|---|---|---|
1.16 ± 0.10 | IMRE | Chowdhury, Heinis, et al., 1986 | ΔGea(423 K) = -26.2 kcal/mol; ΔSea (estimated) = -1.6 eu. |

Normal alkane RI, non-polar column, temperature ramp

View large format table.

Column type Active phase I Reference Comment
CapillaryUltra-11276.Okumura, 199125. m/0.32 mm/0.25 μm, He, 3. K/min; Tstart: 80. C; Tend: 260. C

References

Aldrich Chemical Company Inc., 1990
Aldrich Chemical Company Inc.,
Catalog Handbook of Fine Chemicals, Aldrich Chemical Company, Inc., Milwaukee WI, 1990, 1. [all data]
Timmermans, 1935
Timmermans, J.,
Researches in Stoichiometry. I. The Heat of Fusion of Organic Compounds.,
Bull. Soc. Chim. Belg., 1935, 44, 17-40. [all data]
Buechner, 1906
Buechner, E.H.,
Z. Phys. Chem., Stoechiom. Verwandtschaftsl., 1906, 54, 665. [all data]
Ribeiro da Silva, Lobo Ferreira, et al., 2010
Ribeiro da Silva, Manuel A.V.; Lobo Ferreira, Ana I.M.C.; Santos, Ana Filipa L.O.M.; Rocha, Inês M.,
Thermochemical study of the monobromonitrobenzene isomers,
The Journal of Chemical Thermodynamics, 2010, 42, 2, 169-176, https://doi.org/10.1016/j.jct.2009.06.008
. [all data]