(E)-1-Propenol

Gas phase thermochemistry data

Data compiled by: Hussein Y. Afeefy, Joel F. Liebman, and Stephen E. Stein

Quantity Value Units Method Reference Comment
Δfgas-169.kJ/molIonTurecek, 1984

References

Turecek, 1984
Turecek, F., (E)- and (Z)-Prop-1-en-1-ol: Gas-phase generation and determination of heats of formation by mass spectrometry, J. Chem. Soc. Chem. Commun., 1984, 1374-1375. [all data]