Tetrahydrotriquinacene
- Formula: C10H14
- Molecular weight: 134.2182
- IUPAC Standard InChIKey: VVQPGPGAEHQIBD-UHFFFAOYSA-N
- CAS Registry Number: 57595-39-8
- Chemical structure:
View 3d structure (requires JavaScript / HTML 5) - Permanent link for this species. Use this link for bookmarking this species for future reference.

Reaction thermochemistry data

Data compiled by: Hussein Y. Afeefy, Joel F. Liebman, and Stephen E. Stein
Individual Reactions
By formula: H2 + C10H14 = C10H16
Quantity | Value | Units | Method | Reference | Comment |
---|---|---|---|---|---|
ΔrH° | -115. ± 1. | kJ/mol | Chyd | Liebman, Paquette, et al., 1986 | liquid phase; solvent: Hexane |

Gas phase thermochemistry data

Data compiled by: Hussein Y. Afeefy, Joel F. Liebman, and Stephen E. Stein

Quantity Value Units Method Reference Comment
Δfgas13. ± 4.2kJ/molChydLiebman, Paquette, et al., 1986

References

Liebman, Paquette, et al., 1986
Liebman, J.F.; Paquette, L.A.; Peterson, J.R.; Rogers, D.W.,
Is triquinacene homoaromatic? A thermochemical answer in the affirmative,
J. Am. Chem. Soc., 1986, 108, 8267-8268. [all data]