1-Butene, 3-methyl-2-(1-methylpropoxy)-

Reaction thermochemistry data

Data compiled by: Hussein Y. Afeefy, Joel F. Liebman, and Stephen E. Stein

Individual Reactions

1-Butene, 3-methyl-2-(1-methylpropoxy)- = 2-Butene,2-methyl-3-(1-methylpropoxy)-

By formula: C9H18O = C9H18O

Quantity Value Units Method Reference Comment
Δr4.91 ± 0.50kJ/molEqkTaskinen, 1975gas phase

References

Taskinen, 1975
Taskinen, E., Thermodynamics of vinyl ethers - XI. The effect of the alkoxy group on the relative stabilities of 2-alkoxy-3-mehyl-1-butenes and corresponding 2-butenes, Tetrahedron, 1975, 31, 957-962. [all data]