Propane, 1,1'-[ethylidenebis(oxy)]bis[2-methyl-

Phase change data

Data compiled as indicated in comments:
TRC - Thermodynamics Research Center, NIST Boulder Laboratories, Chris Muzny director
AC - William E. Acree, Jr., James S. Chickos

Quantity Value Units Method Reference Comment
Tboil449.KN/AAdams and Adkins, 1925Uncertainty assigned by TRC = 4. K; TRC

Enthalpy of vaporization

ΔvapH (kJ/mol) Temperature (K) Method Reference Comment
46.1351.AStephenson and Malanowski, 1987Based on data from 336. - 456. K.; AC

In addition to the Thermodynamics Research Center (TRC) data available from this site, much more physical and chemical property data is available from the following TRC products:

Kovats' RI, non-polar column, isothermal

View large format table.

Column type Active phase Temperature (C) I Reference Comment
PackedApiezon L120.949.Bogoslovsky, Anvaer, et al., 1978Celite 545
PackedApiezon L160.959.Bogoslovsky, Anvaer, et al., 1978Celite 545

Normal alkane RI, non-polar column, custom temperature program

View large format table.

Column type Active phase I Reference Comment
CapillarySE-30999.Vinogradov, 2004Program: not specified

Normal alkane RI, polar column, custom temperature program

View large format table.

Column type Active phase I Reference Comment
CapillaryCarbowax 20M1072.Vinogradov, 2004Program: not specified

References

Adams and Adkins, 1925
Adams, E.W.; Adkins, H., Catalysis in Acetal Formation, J. Am. Chem. Soc., 1925, 47, 1358-67. [all data]

Stephenson and Malanowski, 1987
Stephenson, Richard M.; Malanowski, Stanislaw, Handbook of the Thermodynamics of Organic Compounds, 1987, https://doi.org/10.1007/978-94-009-3173-2 . [all data]