3,4-dimethyl-2-pentanone
- Formula: C7H14O
- Molecular weight: 114.1855
- IUPAC Standard InChIKey: QXHRQZNDMYRDPA-UHFFFAOYSA-N
- CAS Registry Number: 565-78-6
- Chemical structure:
View 3d structure (requires JavaScript / HTML 5) - Permanent link for this species. Use this link for bookmarking this species for future reference.

Phase change data

Data compiled by: Thermodynamics Research Center, NIST Boulder Laboratories, Chris Muzny director
Quantity | Value | Units | Method | Reference | Comment |
---|---|---|---|---|---|
Tboil | 408. ± 5. | K | AVG | N/A | Average of 6 values; Individual data points |

References

No reference data available.