Aluminum, dichloroethyl-
- Formula: C2H5AlCl2
- Molecular weight: 126.949
- IUPAC Standard InChIKey: UAIZDWNSWGTKFZ-UHFFFAOYSA-L
- CAS Registry Number: 563-43-9
- Chemical structure:

Reaction thermochemistry data

Data compiled by: José A. Martinho Simões
Individual Reactions
(l) +
(l) = C6H15Al2Cl3 (l)
By formula: C2H5AlCl2 (l) + C4H10AlCl (l) = C6H15Al2Cl3 (l)
Quantity | Value | Units | Method | Reference | Comment |
---|---|---|---|---|---|
ΔrH° | -2.3 ± 0.2 | kJ/mol | RSC | Smith, 1974 | Please also see Pedley and Rylance, 1977. |
By formula: C2H5AlCl2 (l) + C6H15Al (l) = 2C4H10AlCl (l)
Quantity | Value | Units | Method | Reference | Comment |
---|---|---|---|---|---|
ΔrH° | -39.5 ± 0.8 | kJ/mol | RSC | Smith, 1974 | Please also see Pedley and Rylance, 1977. |

References

Smith, 1974
Smith, M.B.,
J. Organometal. Chem., 1974, 76, 171. [all data]
Pedley and Rylance, 1977
Pedley, J.B.; Rylance, J.,
Computer Analysed Thermochemical Data: Organic and Organometallic Compounds, University of Sussex, Brigton, 1977. [all data]