Bromoiodomethane
- Formula: CH2BrI
- Molecular weight: 220.835
- IUPAC Standard InChIKey: TUDWMIUPYRKEFN-UHFFFAOYSA-N
- CAS Registry Number: 557-68-6
- Chemical structure:
View 3d structure (requires JavaScript / HTML 5) - Other names: Methane, bromoiodo-

Phase change data

Data compiled by: Thermodynamics Research Center, NIST Boulder Laboratories, Chris Muzny director
Quantity | Value | Units | Method | Reference | Comment |
---|---|---|---|---|---|
Tfus | 274. | K | N/A | Timmermans, 1935 | Uncertainty assigned by TRC = 1.5 K |

References

Timmermans, 1935
Timmermans, J.,
Researches in Stoichiometry. I. The Heat of Fusion of Organic Compounds.,
Bull. Soc. Chim. Belg., 1935, 44, 17-40. [all data]