Tetradecanoic acid, 2-methyl-, methyl ester

Phase change data

Data compiled by: Thermodynamics Research Center, NIST Boulder Laboratories, Chris Muzny director

Quantity Value Units Method Reference Comment
Tboil411.KN/ASchulte, Krause, et al., 1951no pressure given in C. A.

In addition to the Thermodynamics Research Center (TRC) data available from this site, much more physical and chemical property data is available from the following TRC products:

References

Schulte, Krause, et al., 1951
Schulte, K.E.; Krause, H.; Kirschner, J., Z. Physiol. Chem., 1951, 287, 239. [all data]