Cyclohexane, 1-(cyclohexylmethyl)-2-ethyl-, trans-

Condensed phase thermochemistry data

Data compiled by: Hussein Y. Afeefy, Joel F. Liebman, and Stephen E. Stein

Quantity Value Units Method Reference Comment
Δcliquid-9611.kJ/molCcbLamneck and Wise, 1954Corresponding Δfliquid = -290. kJ/mol (simple calculation by NIST; no Washburn corrections)

References

Lamneck and Wise, 1954
Lamneck, J.H., Jr.; Wise, P.H., Dicyclic hydrocarbons. XI. Synthesis and physical properties of the monoethyldiphenylmethanes and monoethyldicyclohexylmethanes, J. Am. Chem. Soc., 1954, 76, 5108-5110. [all data]