5-ethylnonan-2-one

Phase change data

Data compiled by: Thermodynamics Research Center, NIST Boulder Laboratories, Chris Muzny director

Quantity Value Units Method Reference Comment
Tboil366.KN/AAnonymous, 1936Uncertainty assigned by TRC = 10. K

In addition to the Thermodynamics Research Center (TRC) data available from this site, much more physical and chemical property data is available from the following TRC products:

References

Anonymous, 1936
Anonymous, P., , 1936. [all data]