Cyclotrisiloxane, hexamethyl-

Condensed phase thermochemistry data

Data compiled by: Eugene S. Domalski and Elizabeth D. Hearing

Quantity Value Units Method Reference Comment
solid,1 bar412.1J/mol*KN/AKuliev, Dzhafarov, et al., 1982

Constant pressure heat capacity of solid

Cp,solid (J/mol*K) Temperature (K) Reference Comment
360.0298.15Kuliev, Dzhafarov, et al., 1982T = 4.2 to 370 K. Data given graphically except for data at 298.15 K.

Normal alkane RI, non-polar column, temperature ramp

Data compiled by: NIST Mass Spectrometry Data Center, William E. Wallace, director

Column type CapillaryCapillary
Active phase SP-2100Methyl Silicone
Column length (m) 30.25.
Carrier gas HeHe
Substrate
Column diameter (mm) 0.250.25
Phase thickness (μm)  0.1
Tstart (C) 40.40.
Tend (C) 280.350.
Heat rate (K/min) 5.5.
Initial hold (min) 3.
Final hold (min)
I 827.833.
ReferenceFischer and Kusch, 1993Fujimoto, Ohtani, et al., 1990
Comment MSDC-RI MSDC-RI

References

Kuliev, Dzhafarov, et al., 1982
Kuliev, A.M.; Dzhafarov, O.I.; Karasharli, K.A.; Kostryukov, V.N., Heat capacity and thermodynamic functions of cyclic methylphenylsiloxanes, Zhur. Fiz. Khim., 1982, 56, 310-313. [all data]