4-chloro-2,6-dinitroaniline
- Formula: C6H4ClN3O4
- Molecular weight: 217.567
- IUPAC Standard InChIKey: CLMQUEQFVUMDPC-UHFFFAOYSA-N
- CAS Registry Number: 5388-62-5
- Chemical structure:
View 3d structure (requires JavaScript / HTML 5) - Permanent link for this species. Use this link for bookmarking this species for future reference.

Phase change data

Data compiled by: William E. Acree, Jr., James S. Chickos
Quantity | Value | Units | Method | Reference | Comment |
---|---|---|---|---|---|
ΔsubH° | 105.2 ± 0.7 | kJ/mol | ME | Ribeiro da Silva, Ribeiro da Silva, et al., 2010 | Based on data from 335. to 359. K. |
Enthalpy of sublimation
ΔsubH (kJ/mol) | Temperature (K) | Method | Reference | Comment |
---|---|---|---|---|
104.7 ± 0.4 | 347. | ME | Ribeiro da Silva, Ribeiro da Silva, et al., 2010 | Based on data from 335. to 359. K. |

References

Ribeiro da Silva, Ribeiro da Silva, et al., 2010
Ribeiro da Silva, Manuel A.V.; Ribeiro da Silva, Maria D.M.C.; Santos, Ana Filipa L.O.M.; Ferreira, Ana I.M.C. Lobo; Galvão, Tiago L.P.,
Experimental thermochemical study of two chlorodinitroaniline isomers,
The Journal of Chemical Thermodynamics, 2010, 42, 4, 496-501, https://doi.org/10.1016/j.jct.2009.11.003
. [all data]