Cyclohexane, 1-propenyl-
- Formula: C9H16
- Molecular weight: 124.2233
- IUPAC Standard InChIKey: IAHIMVFWYADCJJ-QHHAFSJGSA-N
- CAS Registry Number: 5364-83-0
- Chemical structure:
View 3d structure (requires JavaScript / HTML 5) - Other names: Cyclohexane, propenyl-; Propene, 1-cyclohexyl-; Propenylcyclohexane; 1-Cyclohexyl-1-propene; 1-Propene, 1-cyclohexyl-

Phase change data

Data compiled by: Thermodynamics Research Center, NIST Boulder Laboratories, Chris Muzny director
Quantity | Value | Units | Method | Reference | Comment |
---|---|---|---|---|---|
Tboil | 431. | K | N/A | Wallach, Churchill, et al., 1908 | Uncertainty assigned by TRC = 6. K |
Tboil | 431. | K | N/A | Wallach, 1908 | Uncertainty assigned by TRC = 6. K |

References

Wallach, Churchill, et al., 1908
Wallach, O.; Churchill, J.B.; Rentschler, M.,
Knowledge of Terpenes and Essential Oils IV. Condensation of Cyclohexanone with Normal-α-bromobutyric Acid,
Justus Liebigs Ann. Chem., 1908, 360, 55-9. [all data]
Wallach, 1908
Wallach, O.,
Knowledge of Terpenes and Essential Oils,
Justus Liebigs Ann. Chem., 1908, 360, 26-44. [all data]