CAS Reg. No. 53221-56-0

Reaction thermochemistry data

Data compiled by: John E. Bartmess

Individual Reactions

(CAS Reg. No. 53221-56-0 • 4294967295Carbon monoxide) + Carbon monoxide = CAS Reg. No. 53221-56-0

By formula: (CAS Reg. No. 53221-56-0 • 4294967295CO) + CO = CAS Reg. No. 53221-56-0

Quantity Value Units Method Reference Comment
Δr56. ± 21.kJ/molN/AEngelking and Lineberger, 1979gas phase
Δr177. ± 15.kJ/molCIDTSunderlin, Wang, et al., 1992gas phase; Affinity: CO..Fe(CO)2-

References

Engelking and Lineberger, 1979
Engelking, P.C.; Lineberger, W.C., Laser photoelectron spectrometry of the negative ions of iron and iron carbonyls. Electron affinity determination for the series Fe(CO)n,n=0,1,2,3,4, J. Am. Chem. Soc., 1979, 101, 5569. [all data]

Sunderlin, Wang, et al., 1992
Sunderlin, L.S.; Wang, D.; Squires, R.R., Metal Carbonyl Bond Strengths in Fe(CO)n- and Ni(CO)n-, J. Am. Chem. Soc., 1992, 114, 8, 2788, https://doi.org/10.1021/ja00034a004 . [all data]