Cortisone
- Formula: C21H28O5
- Molecular weight: 360.4440
- IUPAC Standard InChIKey: MFYSYFVPBJMHGN-YKAMNDFBSA-N
- CAS Registry Number: 53-06-5
- Chemical structure:

Phase change data

Data compiled by: William E. Acree, Jr., James S. Chickos
Enthalpy of fusion
ΔfusH (kcal/mol) | Temperature (K) | Reference |
---|---|---|
8.810 | 495. | Regosz, Chmielewska, et al., 1994 |

References

Regosz, Chmielewska, et al., 1994
Regosz, A.; Chmielewska, A.; Pelplinska, T.; Kowalski, P.,
Prediction of the solubility of steroid hormones,
Pharmazie, 1994, 49, 5, 371. [all data]