3-Phenylcyclobutanone

Condensed phase thermochemistry data

Data compiled by: Hussein Y. Afeefy, Joel F. Liebman, and Stephen E. Stein

Quantity Value Units Method Reference Comment
Δfliquid-56.57kJ/molCcbKrall and Roberts, 1958
Quantity Value Units Method Reference Comment
Δcliquid-5307.8 ± 1.5kJ/molCcbKrall and Roberts, 1958Corresponding Δfliquid = -56.48 kJ/mol (simple calculation by NIST; no Washburn corrections)

Phase change data

Data compiled by: Hussein Y. Afeefy, Joel F. Liebman, and Stephen E. Stein

Quantity Value Units Method Reference Comment
Δvap46.4 ± 0.8kJ/molEKrall and Roberts, 1958

References

Krall and Roberts, 1958
Krall, R.E.; Roberts, J.D., Strain variation in the unsaturated cyclobutane ring, Am. Chem. Soc. Div. Pet. Chem., 1958, 3, 63-68. [all data]