Gluconic acid

Condensed phase thermochemistry data

Data compiled by: Hussein Y. Afeefy, Joel F. Liebman, and Stephen E. Stein

Quantity Value Units Method Reference Comment
Δcsolid-2489.1 ± 2.3kJ/molCcbStroh and Kuchenmeister, 1964Corresponding Δfsolid = -1586.9 kJ/mol (simple calculation by NIST; no Washburn corrections)

References

Stroh and Kuchenmeister, 1964
Stroh, H.H.; Kuchenmeister, W., Verbrennungswarmen von zuckerderivaten, Z. Chem., 1964, 4, 427-428. [all data]