1,1':4',1''-terphenyl, 4-heptyl-

Phase change data

Data compiled by: Thermodynamics Research Center, NIST Boulder Laboratories, Chris Muzny director

Quantity Value Units Method Reference Comment
Tfus424.KN/ASchmidt-Collerus, Krimmel, et al., 1961Uncertainty assigned by TRC = 5. K

In addition to the Thermodynamics Research Center (TRC) data available from this site, much more physical and chemical property data is available from the following TRC products:

References

Schmidt-Collerus, Krimmel, et al., 1961
Schmidt-Collerus, J.J.; Krimmel, J.A.; Bohner, G.E., Synthesis and Investigation of Polynuclear Alkyl-Polyphenyl Hydrocarbons as Potential High Temperatures and Radiation Resistant Fluids, J. Chem. Eng. Data, 1961, 6, 118. [all data]