2,3-Dimethyl-2,3-bis(4-tert-butylphenyl)butane

Gas phase thermochemistry data

Data compiled by: Hussein Y. Afeefy, Joel F. Liebman, and Stephen E. Stein

Quantity Value Units Method Reference Comment
Δfgas-139. ± 3.kJ/molCcbKratt, Beckhaus, et al., 1983ΔHfusion=10.5±0.1 kcal/mol

References

Kratt, Beckhaus, et al., 1983
Kratt, G.; Beckhaus, H.D.; Bernlohr, W.; Ruchardt, C., Thermolabile kohlenwasserstoffe. XVII. Verbrennungsenthalpie und bildungsenthalpie von zehn sym.-tetraalkyl-1,2-diarylethanen, Thermochim. Acta, 1983, 62, 279-194. [all data]