Benzofurazan, 4,6-dinitro-, 1-oxide

Phase change data

Data compiled by: William E. Acree, Jr., James S. Chickos

Enthalpy of fusion

ΔfusH (kJ/mol) Temperature (K) Reference
20.73452.7Reddy, Murali, et al., 1983

References

Reddy, Murali, et al., 1983
Reddy, G. Om; Murali, B.K. Mohan; Chatterjee, A.K., Thermal Study on Picryl Azide (2-azido-1,3,5-trinitrobenzene) decomposition using simultaneous thermogravimetry and differential scanning calorimetry, Propellants Explos. Pyrotech., 1983, 8, 1, 29-33, https://doi.org/10.1002/prep.19830080107 . [all data]