1(2H)-Naphthalenone, 3,4-dihydro-5,8-dimethyl-
- Formula: C12H14O
- Molecular weight: 174.2390
- IUPAC Standard InChIKey: ZSMGKPHICFZGQU-UHFFFAOYSA-N
- CAS Registry Number: 5037-63-8
- Chemical structure:
View 3d structure (requires JavaScript / HTML 5) - Other names: 5,8-Dimethyl-3,4-dihydro-1(2H)-naphthalenone; 5,8-Dimethyltetralone

Phase change data

Data compiled by: Thermodynamics Research Center, NIST Boulder Laboratories, Chris Muzny director
Quantity | Value | Units | Method | Reference | Comment |
---|---|---|---|---|---|
Tfus | 305.2 | K | N/A | Kadesch, 1944 | Uncertainty assigned by TRC = 2. K |

References

Kadesch, 1944
Kadesch, R.G.,
Some New Aspects of the Ortho Effect. Cyclic Ketones Related to Acetophenone,
J. Am. Chem. Soc., 1944, 66, 1207-13. [all data]