3-Pyridinecarboxylic acid, 6-hydroxy-

Phase change data

Data compiled by: William E. Acree, Jr., James S. Chickos

Quantity Value Units Method Reference Comment
Δsub146.4 ± 4.6kJ/molMESantos, Figueira, et al., 2009Based on data from 461. - 488. K.

Enthalpy of sublimation

ΔsubH (kJ/mol) Temperature (K) Method Reference Comment
143.0 ± 4.5475.MESantos, Figueira, et al., 2009Based on data from 461. - 488. K.

References

Santos, Figueira, et al., 2009
Santos, Rui C.; Figueira, Rita M.B.B.M.; Piedade, M. Fatima M.; Diogo, Herminio P.; Minas da Piedade, Manuel E., Energetics and Structure of Hydroxynicotinic Acids. Crystal Structures of 2-, 4-, 6-Hydroxynicotinic and 5-Chloro-6-hydroxynicotinic Acids, J. Phys. Chem. B, 2009, 113, 43, 14291-14309, https://doi.org/10.1021/jp906908n . [all data]