2,6-Pyridinedicarboxylic acid

Phase change data

Data compiled by: William E. Acree, Jr., James S. Chickos

Quantity Value Units Method Reference Comment
Δsub137.1 ± 5.7kJ/molCMatos, Morais, et al., 2005

References

Matos, Morais, et al., 2005
Matos, M. Agostinha R.; Morais, Victor M.F.; Ribeiro da Silva, Maria D.M.C.; Marques, Marta C.F.; Sousa, Emanuel A.; Castiñeiras, Jorge P.; Santos, Cláudia P.; Acree, W.E., Thermochemical and Theoretical Studies of Dimethylpyridine-2,6-dicarboxylate and Pyridine-2,3-, Pyridine-2,5-, and Pyridine-2,6-dicarboxylic Acids, J. Chem. Eng. Data, 2005, 50, 4, 1184-1191, https://doi.org/10.1021/je049586l . [all data]