Phenol, 2-methyl-3,5-dinitro-

Phase change data

Data compiled by: William E. Acree, Jr., James S. Chickos

Enthalpy of sublimation

ΔsubH (kJ/mol) Temperature (K) Method Reference Comment
103.3290. - 324.TEBalson, 1947See also Jones, 1960.

References

Balson, 1947
Balson, E.W., Studies in vapour pressure measurement, Part III.?An effusion manometer sensitive to 5 «65533» 10?6 millimetres of mercury: vapour pressure of D.D.T. and other slightly volatile substances, Trans. Faraday Soc., 1947, 43, 54, https://doi.org/10.1039/tf9474300054 . [all data]

Jones, 1960
Jones, A.H., Sublimation Pressure Data for Organic Compounds., J. Chem. Eng. Data, 1960, 5, 2, 196-200, https://doi.org/10.1021/je60006a019 . [all data]