1-Adamantaneacetic acid
- Formula: C12H18O2
- Molecular weight: 194.2701
- IUPAC Standard InChIKey: AOTQGWFNFTVXNQ-UHFFFAOYSA-N
- CAS Registry Number: 4942-47-6
- Chemical structure:
View 3d structure (requires JavaScript / HTML 5) - Other names: Tricyclo[3.3.1.1(3,7)-]decane-1-acetic acid; 1-Adamantylacetic acid; tricyclo[3.3.1.13,7]dec-1-ylacetic acid

Gas phase ion energetics data

Data compiled by: John E. Bartmess
De-protonation reactions
C12H17O2- + =
By formula: C12H17O2- + H+ = C12H18O2
Quantity | Value | Units | Method | Reference | Comment |
---|---|---|---|---|---|
ΔrH° | 1438. ± 9.2 | kJ/mol | G+TS | Caldwell, Renneboog, et al., 1989 | gas phase |
Quantity | Value | Units | Method | Reference | Comment |
ΔrG° | 1409. ± 8.4 | kJ/mol | IMRE | Caldwell, Renneboog, et al., 1989 | gas phase |

Reaction thermochemistry data

Data compiled by: John E. Bartmess
Individual Reactions
C12H17O2- + =
By formula: C12H17O2- + H+ = C12H18O2
Quantity | Value | Units | Method | Reference | Comment |
---|---|---|---|---|---|
ΔrH° | 1438. ± 9.2 | kJ/mol | G+TS | Caldwell, Renneboog, et al., 1989 | gas phase |
Quantity | Value | Units | Method | Reference | Comment |
ΔrG° | 1409. ± 8.4 | kJ/mol | IMRE | Caldwell, Renneboog, et al., 1989 | gas phase |

References

Caldwell, Renneboog, et al., 1989
Caldwell, G.; Renneboog, R.; Kebarle, P.,
Gas Phase Acidities of Aliphatic Carboxylic Acids, Based on Measurements of Proton Transfer Equilibria,
Can. J. Chem., 1989, 67, 4, 661, https://doi.org/10.1139/v89-092
. [all data]